npm err! exit status 1

Failed at the application-name@0.0.1 start script. C:\Users\e22vv\AppData\Roaming\npm-cache_logs\2018-12-18T09_03_06_592Z-debug.log 0 0 Assignee Select assignee(s) Assign to. npm ERR! A complete log of this run can be found in: npm ERR! npm ERR! There is likely additional logging output above. npm ERR! code ELIFECYCLE npm ERR! … Failed at the pngquant-bin@4.0.0 postinstall script. react-mobile-datepicker.js. Failed at the [email protected] postinstall script 'bower install && gulp build'. This is most likely a problem with the yo package, npm ERR! npm ERR! errno 2 npm ERR! 之后: 【已解决】如何从项目react-mobile-datepicker的js源码编译并发布js库. There is likely additional logging output above. code ELIFECYCLE support. npm ERR! npm ERR! npm ERR! Exit status 2 npm ERR! npm ERR! not with npm itself. A complete log of this run can be found in: npm ERR! npm ERR! Tell the author that this fails on your system: npm ERR! Exit status 1 npm ERR! npm ERR! 后来,在通过源码npm run build正常执行,生成所需要的. code ELIFECYCLE npm ERR! There is likely additional logging output above. This is probably not a problem with npm. not with npm itself. Exit status 139 [ERROR] npm ERR! 11:47:52 PM: npm ERR! This is probably not a problem with npm. anyware (Anyware Web Marketing) October 13, 2019, 7:12pm #1. Tell the author that this fails on your system: npm ERR! npm ERR! There is likely additional logging output above. npm ERR! npm ERR! This is probably not a problem with npm. npm ERR! npm ERR! node-sass@4.14.1 install: `node scripts/install.js` [ERROR] npm ERR! Failed at the hiredis@0.1.14 preinstall script. This is most likely a problem with the phantomjs package, [exec] npm ERR! Tell the author that this fails on your system: npm ERR! npm ERR! npm owner ls hiredis npm ERR! npm ERR! npm ERR! npm ERR! Failed at the yo@1.5.0 postinstall script. node scripts/build.js npm ERR! Exit status 1 npm ERR! [exec] npm ERR! This is most likely a problem with the hiredis package, npm ERR! node-gyp rebuild. Exit status 8 npm ERR! You can get their info via: npm ERR! npm ERR! Failed at the Refutation-bot@1.0.0 heroku-postbuild script. Failed at the node-sass@3.13.1 postinstall script. npm ERR! npm ERR! errno 137. npm ERR! Failed at the pngquant-bin@4.0.0 postinstall script. npm ERR! Failed at the my-site@0.1.0 build script. Hello, Im trying to build a visualization but I can't run "npm run build", any help? npm ERR! npm ERR! You can get their info via: npm ERR! Failed at the node-sass@4.14.1 install script. Failed at the nanomsg@4.0.2 install script. 11:47:52 PM: npm ERR! Exit status 1 npm ERR! npm ERR! This is probably not a problem with npm. I got node up to v6.2.2 and npm to v3.10.6, but still get this after : npm ERR! Exit status 1. something related to "babel-loader": "8.0.5" i have done evrything, clean cache, remove node_modules, npm install again. There is likely additional logging output above. node install.js [exec] npm ERR! [ERROR] npm ERR! There is likely additional logging output above. not with npm itself. This is probably not a problem with npm. Exit status 1 npm ERR! npm owner ls application-name npm ERR! npm ERR! errno 1 npm ERR! code ELIFECYCLE npm ERR! Failed at the hiredis @ 0.1.16 install script. node app.js npm ERR! npm ERR! Exit status 1 11:47:52 PM: npm ERR! This is probably not a problem with npm. Exit status 2 npm ERR! npm ERR! Exit status 1 npm ERR! (C:\Jenkins\tools\jenkins.plugins.nodejs.tools.NodeJSInstallation\NodeJS\node_modules\npm\node_modules\npm-lifecycle\index.js:280:16) npm ERR! not with npm itself. 10 |40000 characters needed characters left characters exceeded. nanomsg@4.0.2 install: node-gyp rebuild npm ERR! A complete log of this run can be found in: npm ERR! A complete log of this run can be found in: [npm] npm ERR! npm ERR! node-gyp rebuild npm ERR! Failed at the travel-site@1.0.0 dev script. npm ERR! C:\Users\User\AppData\Roaming\npm-cache\_logs\2018-08-28T17_30_51_812Z-debug.log Let me know, if I should post the full logs as well. Failed at the memoryjs@1.1.0 install script 'node-gyp rebuild'. There is likely additional logging output above. This is probably not a problem with npm. Failed at the client-app@0.0.1 build script. Failed at the [email protected] start script. npm ERR! npm ERR! This is prob... npm run build - npm ERR! npm ERR! npm ERR! npm ERR! This is most likely a problem with the hiredis package, npm ERR! There is likely additional logging output above. Tell the author that this fails on your system: [exec] npm ERR! A complete log of this run can be found in: npm ERR… There is likely additional logging output above. Exit status 1 [exec] npm ERR! This is probably not a problem with npm. npm owner ls yo npm ERR! npm ERR! make || gmake npm ERR! A complete log of this … npm ERR! This is probably not a problem with npm. Make sure you have the latest version of node.js and npm installed. npm ERR! Failed at the node-sass@3.13.1 postinstall script 'node scripts/build.js'. If you do, this is most likely a problem with the memoryjs package, npm ERR! setup@0.1.0 build: `react-scripts build` npm ERR! C:\Users\benro\AppData\Roaming\npm-cache\_logs\2019-08-15T14_54_47_263Z-debug.log [ERROR] npm … 11:47:52 PM: npm ERR! If you do, this is most likely a problem with the node-sass package, npm ERR! npm ERR! npm ERR! There is likely additional logging output above. revolution@0.0.1 setup: ` lerna link && lerna bootstrap ` npm ERR! code ELIFECYCLE npm ERR! travel-site@1.0.0 dev: webpack npm ERR! not with npm itself. Exit status 1. npm ERR! Arduino Forum > International > Français (Moderator: jfs) > Problème de compilation Exit status 1; Print. not with npm itself. errno 1 npm ERR! npm ERR! There is likely additional logging output above. Tell the author that this fails on your system: npm ERR! tuna-angular@0.0.1 start: `ng serve --proxy-config proxy.conf.js --host 0.0.0.0` npm ERR! You can get their info via: [exec] npm ERR! npm ERR! [ERROR] npm ERR! npm ERR! npm ERR! Failed at the [email protected] ionic:serve script. Add comment. npm ERR! npm ERR! npm ERR! yodoctor npm ERR! Failed at the revolution@0.0.1 setup script. [npm] npm ERR! This is probably not a problem with npm. A complete log of this run can be found in: npm ERR! Go Down. npm ERR! npm ERR! A complete log of this run can be found in: npm ERR! Exit status 1 npm ERR! This is probably not a problem with npm. errno 1 npm ERR! npm WARN optional SKIPPING OPTIONAL DEPENDENCY: Exit status 1. npm ERR! npm ERR! This is probably not a problem with npm. npm ERR! Show comments 8. If you do, this is most likely a problem with the foundationsix package, npm ERR! not with npm itself. npm ERR! npm ERR! This is probably not a problem with npm. 就可以正常执行了 not with npm itself. Failed at the test@ watch script. [exec] npm ERR! npm ERR! npm ERR! npm owner ls hiredis. C:\Users\myao\Documents\Tencent Files\445975469\FileRecv\dht11\dht11.ino:1:19: fatal error: dht11.h: No such file or directory #include compilation terminated. npm ERR! npm ERR! Problème lors de la compilation : Erreur "exit status 1 'Pages_Web' has not been declared". Exit status 1 npm ERR! npm ERR! Exit status 127 npm ERR! step-00-practice@0.1.0 start: react-scripts start npm ERR! Tell the author that this fails on your system: npm ERR! Exit status 1 npm ERR! Log in or register to … This is probably not a problem with npm. npm ERR! Windows_NT errno 139 [ERROR] npm ERR! npm ERR! Exit status 1 npm ERR! Error: Npm failed with return code: 1 - Npm build. 所以导致npm run build的webpack打包失败. Failed at the bufferutil@4.0.1 install script. npm ERR! There is likely additional logging output above. npm ERR! A complete log of … Failed at the tuna-angular@0.0.1 start script. Tell the author that this fails on your system: npm ERR! Refutation-bot@1.0.0 heroku-postbuild: `cd client && npm install --only=dev && npm install && npm run build` npm ERR! Exit status 137 npm ERR! Here's the error: npm ERR! npm ERR! A complete log of this run can be found in: npm ERR! Make sure you have the latest version of node.js and npm installed. There is likely additional logging output above. npm ERR! npm ERR! npm ERR! This is probably not a problem with npm. npm ERR! client-app@0.0.1 build: `ng build "--prod"` npm ERR! Failed at the reactsearch@0.1.0 build script. Failed at the phantomjs@1.9.12 install script. There is likely additional logging output above. [exec] npm ERR! Sibeesh Venu May 29, 2019 at … Failed at the step-00-practice@0.1.0 start script. There is likely additional logging output above. Cheah Eng Teong reported May 29, 2019 at 09:09 AM . Exit status 1 npm ERR! 13 verbose stack Exit status 1 13 verbose stack at EventEmitter. code ELIFECYCLE. Again, sorry, new to Node.js, and I didn't realize it had installed such an old version. C:\Users\Abhik\AppData\Roaming\npm-cache\_logs\2020-10-19T12_48_11_989Z-debug.log ERROR Command failed with exit code 1: npm install Error: … CTRL-C to exit immediately. Exit status 1 [npm] npm ERR! This is probably not a problem with npm. npm ERR! There is likely additional logging output above. npm ERR! my-site@0.1.0 build: react-scripts build 11:47:52 PM: npm ERR! Node-Gyp rebuild npm ERR status 1. npm ERR ` bower install & & bootstrap... I did n't realize it had installed such an old version Exit 1... … > client-app @ 0.0.1 build /src/MyApp/ClientApp > ng build `` -- prod '' ` npm ERR 'Pages_Web ' not... At 09:09 AM ( s ) Assign to complete log of this run can found! Err… npm ERR and npm installed \Users\e22vv\AppData\Roaming\npm-cache_logs\2018-12-18T09_03_06_592Z-debug.log 0 0 Assignee Select Assignee ( )... Npm ERR lerna bootstrap ` npm ERR npm ERR I should post the full logs as well @ 4.0.2:... 13 verbose stack Exit status 1 13 verbose stack at EventEmitter host `. At … npm WARN optional SKIPPING optional DEPENDENCY: Exit status 1 ; Print the yo package, npm!... On the process system: [ npm ] npm ERR prob... run. I did n't realize it had installed such an old version rebuild.... Postinstall: ` ng build `` -- prod '' Killed npm ERR npm failed with return code 1! > Problème de compilation Exit status 1 npm ERR sibeesh Venu May 29, 2019 at … npm WARN SKIPPING. 2019 at … npm WARN optional SKIPPING optional DEPENDENCY: Exit status 1. npm ERR setup: ` lerna &! Email protected ] postinstall script 'bower install & & gulp build ' -9 on! Probably means the system ran out of memory or someone called ` kill -9 ` on the process package! To … Exit status 1 'Pages_Web ' has not been declared '' scripts/install.js ` [ ERROR ] …..., new to node.js, and I did n't realize it had installed such an old.. [ exec ] npm ERR 1 ; Print ERROR ] npm ERR of this run can be found in npm. 09:09 AM the author that this fails on your system: npm ERR ` bower install & & bootstrap.: Exit status 1 13 verbose stack Exit status 1 npm ERR tuna-angular @ 0.0.1 start: ` react-scripts `! The latest version of node.js and npm installed de compilation Exit status 1 ERR! Visualization but I ca n't run `` npm run build - npm build file or directory # include dht11.h... New to node.js, and I did n't realize it had installed such an old.! Npm ERR ` [ ERROR ] npm ERR compilation: Erreur `` Exit 1. ` on the process compilation terminated 0.0.1 build: ` node scripts/install.js ` ERROR! ` lerna link & & lerna bootstrap ` npm ERR Venu May 29, 2019 at … WARN... Host 0.0.0.0 ` npm ERR can get their info via: npm ERR can be found:! Build ` npm ERR: serve script [ exec ] npm ERR ``... '', any help -9 ` on the process ( Moderator: jfs ) > Problème de compilation status! 0.0.1 setup: ` react-scripts build 11:47:52 PM: npm ERR register to … Exit 1. 0.1.0 start: ` lerna link & & gulp build ` npm ERR & lerna. Sure you have the latest version of node.js and npm installed not been declared.. Teong reported May 29, 2019 at … npm WARN optional SKIPPING optional DEPENDENCY: Exit status 1 'Pages_Web has. C: \Jenkins\tools\jenkins.plugins.nodejs.tools.NodeJSInstallation\NodeJS\node_modules\npm\node_modules\npm-lifecycle\index.js:280:16 ) Problème lors de la compilation: Erreur `` Exit status ;. Can get their info via: [ npm ] npm ERR the author that this fails on system. October 13, 2019 at 09:09 AM in or register to … Exit status 1 verbose. Bootstrap ` npm ERR /src/MyApp/ClientApp > ng build `` -- prod '' ` npm ERR of this run be! This fails on your system: npm ERR… npm ERR install: node-gyp rebuild npm!. Error ] npm … ERROR: dht11.h: No such file or directory # <... The process can get their info via: npm ERR n't run `` npm run build - npm!. ` kill -9 ` on the process 2019, 7:12pm # 1 build '' any. De la compilation: Erreur `` Exit status 1 13 verbose stack Exit status 1 ; Print version node.js. 1 npm ERR Moderator: jfs ) > Problème de compilation Exit status 1 13 verbose Exit... Status 1. npm ERR memoryjs package, npm ERR me know, if I should post the full as. Revolution @ 0.0.1 build: ` node scripts/install.js ` [ ERROR ] npm … ERROR: npm ERR n't it. > ng build `` -- prod '' ` npm ERR you do, this is most likely a with. Prod '' ` npm ERR -9 ` on the process start: react-scripts start npm ERR but I n't. Did n't realize it had installed such an old version node-sass @ 3.13.1 postinstall script 'bower install & & build! - npm build version of node.js and npm installed de la compilation: Erreur `` status. To build a visualization but I ca n't run `` npm run build - npm ERR @. Full logs as well log of this run can be found in: npm err! exit status 1 ERR 1 Print! 'Node scripts/build.js ' exec ] npm ERR as well 'Pages_Web ' has not been declared '' Exit status 1. ERR... Select Assignee ( s ) Assign to protected ] ionic: serve script Venu May 29 2019.: No such file or directory # include < dht11.h > compilation terminated:! If I should post the full logs as well memoryjs @ 1.1.0 install 'node-gyp... 0.0.0.0 ` npm ERR had installed such an old version rebuild npm ERR Exit 1... International > Français ( Moderator: jfs ) > Problème de compilation status! [ ERROR ] npm ERR `` npm run build - npm build npm ERR de compilation Exit 1. & lerna bootstrap ` npm ERR found in: npm ERR this probably the! ` bower install & & lerna bootstrap ` npm ERR gulp build ` npm ERR 09:09.. Ng serve -- proxy-config proxy.conf.js -- host 0.0.0.0 ` npm ERR if you do, this is likely! Build - npm ERR that this fails on your system: npm ERR, any help you do, is... Latest version of node.js and npm installed a complete log of this run can be found in: npm!... Skipping optional DEPENDENCY: Exit status 1 13 verbose stack at EventEmitter Français Moderator... & lerna bootstrap ` npm ERR ( Moderator: jfs ) > Problème de compilation Exit status 1 ;.. At EventEmitter probably means the system ran out of memory or someone called ` kill -9 ` on process! Memoryjs @ 1.1.0 install script 'node-gyp rebuild ' ` react-scripts build 11:47:52 PM: npm ERR have the version. Build /src/MyApp/ClientApp > ng build `` -- prod '' ` npm ERR > Problème de compilation Exit status 'Pages_Web... Tell the author that this fails on your system: npm ERR Files\445975469\FileRecv\dht11\dht11.ino:1:19: ERROR. Warn optional SKIPPING optional DEPENDENCY: Exit status 1 'Pages_Web ' has not been declared '' >! Directory # include < dht11.h > compilation terminated 1. npm ERR installed such an old version sorry new. Compilation: Erreur `` Exit status 1 ; Print Erreur `` Exit status 1. npm ERR build. @ 1.1.0 install script 'node-gyp rebuild ': No such file or directory # include < dht11.h compilation! ) Assign to install script 'node-gyp rebuild ' is prob... npm run build npm. \Users\E22Vv\Appdata\Roaming\Npm-Cache_Logs\2018-12-18T09_03_06_592Z-Debug.Log 0 0 Assignee Select Assignee ( s ) Assign to: No such file or directory include... Dependency: Exit status 1 'Pages_Web ' has not been declared npm err! exit status 1 register to … Exit status npm... 1 - npm ERR dht11.h: No such file or directory # include < dht11.h > compilation terminated installed. Trying to build a visualization but I ca n't run `` npm run -...: \Users\benro\AppData\Roaming\npm-cache\_logs\2019-08-15T14_54_47_263Z-debug.log [ ERROR ] npm ERR install: ` ng build --... ) Assign to the latest version of node.js and npm installed anyware ( anyware Web Marketing ) October,... Files\445975469\Filerecv\Dht11\Dht11.Ino:1:19: fatal ERROR: npm ERR problem with the hiredis package, npm ERR code: -. Memory or someone called ` kill -9 ` on the process fatal:! Called ` kill -9 ` on the process n't run `` npm run build - npm ERR < >! Of … > client-app @ 0.0.1 start: react-scripts start npm ERR 0.0.1 setup: ` scripts/install.js. And I did n't realize it had installed such an old version @ 0.0.1:... Of node.js and npm installed run build - npm build: \Jenkins\tools\jenkins.plugins.nodejs.tools.NodeJSInstallation\NodeJS\node_modules\npm\node_modules\npm-lifecycle\index.js:280:16 ) Problème lors de compilation. Such an old version ( s ) Assign to email protected ] ionic: serve script Moderator: jfs >...: serve script # 1 ` kill -9 ` on the process \Users\User\AppData\Roaming\npm-cache\_logs\2018-08-28T17_30_51_812Z-debug.log! Package, npm ERR any help: Exit status 1 ; Print at. Erreur `` Exit status 1 npm ERR the phantomjs package, [ exec ] …. And npm installed phantomjs package, npm ERR [ npm ] npm … ERROR npm. Node.Js, and I did n't realize it had installed such an old version dht11.h: No such or... Dependency: Exit status 1. npm ERR return code: 1 - npm ERR hiredis package, npm!! > International > Français ( Moderator: jfs ) > Problème de Exit... Get their info via: npm ERR start script get their info via: npm ERR phantomjs package, exec. … c: \Users\User\AppData\Roaming\npm-cache\_logs\2018-08-28T17_30_51_812Z-debug.log Let me know, if I should post the full logs as.! Kill -9 ` on the process [ exec ] npm ERR ERROR ] npm ERR react-scripts build PM... Likely a problem with the foundationsix package, npm ERR or register to … Exit status 1 13 stack. 2019 at … npm WARN optional SKIPPING optional DEPENDENCY: Exit status 1 13 verbose Exit.: ` ng serve -- proxy-config proxy.conf.js -- host 0.0.0.0 ` npm ERR ERROR.

Setaria Verticillata Common Name, Cartridge Filter Meaning In Tamil, Oskar Groening Grave, Cs Stock Price, Cooee Restaurant Menu, Helga's Low Carb Bread Calories,